{"text_format":"1","workbook":"xlsx","n_sheets":7,"sheets":["Algemene gegevens","BV & Plaatsing","Aanzuivering","Tussenblad","Schriftelijke verklaring","Vrij blad","Validaties"],"not_rendered":{"charts":0,"images":0,"macros":1,"external_links":1,"defined_names":40,"comments":5,"pivot_tables":1},"unopened":[],"bounds":{"document_bytes":16777216,"sheet_cells":100000,"rows_first":2000,"rows_last":500,"rows_between":2000,"halvings":0,"cell_chars":16384,"cell_head_chars":4096},"cells_cut":0,"cells_raw":0,"read":"whole","date_system":"1900"}

{"sheet":"Algemene gegevens","index":0,"n_rows":26,"n_cols":12,"rows_kept":26,"cut":false,"hidden":false,"merged":[[21,2,29,4],[13,2,13,3],[12,2,12,3],[3,2,3,4],[18,6,20,9],[5,6,11,8],[6,2,6,3],[9,2,9,3],[8,2,8,3],[25,0,35,0],[4,6,4,8],[5,2,5,3],[17,2,19,4],[4,2,4,3],[11,2,11,3],[0,0,22,0],[0,2,0,4],[0,6,0,9],[7,2,7,3],[10,2,10,3],[15,2,16,4],[15,6,17,9],[12,6,12,8],[22,6,29,9],[3,6,3,9]]}
["Aanzuiveringsafrekening BB",null,null,null,null,null,null,null,null,null,null,"Actieve Veredeling"]
[null,null,"Douane",null,null,null,null,null,null,null,null,"Bijzondere Bestemming"]
[]
[null,null,"Gegevens Vergunninghouder",null,null,null,"Gegevens Vergunning"]
[null,null,"Naam:",null,null,null,"Periode:"]
[null,null,"Adres:",null,null,null,"De periode geldt voor één maand"]
[null,null,"Woonplaats:"]
[null,null,"EORI nummer:"]
[null,null,"Telefoon:"]
[null,null,"Einddatum vergunning:"]
[null,null,"Vergunning:",null,"Bijzondere bestemming"]
[null,null,"Vergunningnummer:"]
[null,null,"Contactpersoon:",null,null,null,"Aanzuiveringstermijn in maanden:"]
[null,null,"E-mail adres:"]
[]
[null,null,"Aanzuiveringsafrekening ter beschikking gesteld door de Douane.",null,null,null,"De juistheid van de door u ingevulde gegevens blijft uw verantwoordelijkheid!"]
[]
[null,null,"De Aanzuiveringsafrekening dient bij inlevering begeleid te worden door de schriftelijke verklaring opgenomen in het blad 'Schriftelijke verklaring'."]
[null,null,null,null,null,null,"Indien er een storing is tijdens het gebruik van de Aanzuiveringsafrekening kunt u contact opnemen met uw klantmanager of het Bedrijven Contact Punt."]
[]
{"$rows_left_out":7}
{"sheet":"BV & Plaatsing","index":1,"n_rows":492,"n_cols":34,"rows_kept":492,"cut":false,"hidden":false,"merged":[[8,15,9,15],[8,26,9,26],[491,1,491,3],[25,0,35,0],[8,5,9,5],[8,8,9,8],[0,0,22,0],[4,2,4,3],[8,3,9,3],[1,1,1,3],[0,1,0,3],[2,2,2,3],[3,2,3,3],[8,25,9,25],[8,1,9,1],[8,2,9,2],[8,12,9,12],[8,24,9,24],[8,23,9,23],[8,10,9,10],[7,15,7,17],[8,16,9,16],[7,12,7,14],[8,21,9,21],[8,20,9,20],[8,19,9,19],[8,18,9,18],[8,11,9,11],[8,22,9,22],[8,13,9,13],[8,17,9,17],[8,14,9,14],[7,2,7,6],[8,6,9,6],[8,7,9,7],[8,9,9,9],[8,4,9,4]]}
[{"$f":"'Algemene gegevens'!A1:A23","v":"Aanzuiveringsafrekening BB"},"Douane",null,null,1,null,null,null,null,{"$f":"IF(periode=\"\",DATE(2030,1,1),IF(VALUE(LEFT(periode,4))>2010,DATE(LEFT(periode,4),RIGHT(periode,2)+1,1),\"\"))","v":47484}]
[null,"Blad 'BV & Plaatsing' ",null,null,null,null,null,null,null,null,"PLAATSING","IM",null,null,null,null,null,null,null,null,null,null,null,"Hoeveelheid","Invoerrecht",null,null,null,null,null,"Geen geplaatste goederen geboekt","Geen aangiften om aan te zuiveren"]
[null,"Naam:",{"$f":"naam","v":0},null,null,null,null,null,null,null,"BV","EU",null,null,null,null,null,null,null,null,null,null,"Totaal restant BV:"]
[null,"Periode:",{"$f":"periode","v":0},null,null,null,null,null,null,null,null,"Inschr",null,null,null,null,null,null,null,null,null,null,"Totaal restant:",{"$f":"SUM($X$12:$X$490)","v":0},{"$f":"SUM($Y$12:$Y$490)","v":0}]
[]
[]
[]
[null,null,"Aangiftegegevens plaatsing",null,null,null,null,null,null,null,null,null,"Ad valorem recht",null,null,"Specifiek recht"]
[null,"Soort mutatie","Soort\naangifte","Aangifte Identificatie Nummer","Plaats van afgifte","Datum aanvaarding (DD-MM-JJ)","Datum plaatsing      (DD-MM-JJ)","Referentienummer in de administratie","Datum \naanzuivering","Is de datum van aanzuivering overschreden?","Omschrijving geplaatste goederen (evt.in de vorm van een artikelnummer)","Taric-code","Inv.\nrecht%","Douanewaarde","Rechten\nAVR","Tarief","Heffings-\ngrondslag","Rechten\nSR","Totaal Rechten","Hoeveelheid geplaatste goederen","Eenheid hoeveelheid (b.v. kilo, liter, gram, stuk)","Hoeveelheid vorige periode(n) aangezuiverd","Hoeveelheid deze periode aangezuiverd","Restant hoeveelheid","Restant rechten (gerelateerd aan hoeveelheid)","Totaal rechten in deze \nperiode aangezuiverd \n(gerelateerd aan hoeveelheid)","Opmerkingen (vrij tekstveld)"]
[null,null,null,null,null,null,null,null,null,null,null,null,null,null,null,null,null,null,null,null,null,null,null,null,null,null,null,null,"Aangiftenummer","Hoeveelheid"]
[null,"lege regel","lege regel",null,"8/12/2017","Bewerkte goederen",null,"lege regel",null,null,"lege regel",null,null,null,null,null,null,null,null,null,null,null,null,null,null,null,"lege regel","2017-08-30",null,null,null,null,null,"Invoergoederen"]
[null,null,null,null,null,null,null,null,{"$f":"IF(AND(G12>40000,termijn>0),EDATE(G12,termijn),\"\")","v":""},{"$f":"IF(AND(G12>0,termijn>0),IF(AND(($J$1)>I12,X12>0),\"Termijn overschreden\",\"\"),\"\")","v":""},null,null,null,null,null,null,null,null,{"$f":"R12+O12","v":0},null,null,null,{"$f":"SUM(IF(Aanzuivering!$AC$10:$AC$490=D12,Aanzuivering!$O$10:$O$490,0))","v":0},{"$f":"IF(OR((T12-V12-W12)>0.01,(T12-V12-W12)<-0.01),T12-V12-W12,0)","v":0},{"$f":"IF(AND(X12<>0,S12>0),IF(OR((S12/T12*X12) > 0.5,(S12/T12*X12) < -0.5),ROUND(S12/T12*X12,2),0),0)","v":0},{"$f":"IF(W12>0,ROUND(W12/T12*S12,2),0)","v":0},null,null,{"$f":"D12","v":0},{"$f":"X12","v":0}]
[null,null,null,null,null,null,null,null,"","",null,null,null,null,null,null,null,null,{"$f":"R13+O13","v":0},null,null,null,{"$f":"SUM(IF(Aanzuivering!$AC$10:$AC$490=D13,Aanzuivering!$O$10:$O$490,0))","v":0},{"$f":"IF(OR((T13-V13-W13)>0.01,(T13-V13-W13)<-0.01),T13-V13-W13,0)","v":0},{"$f":"IF(AND(X13<>0,S13>0),IF(OR((S13/T13*X13) > 0.5,(S13/T13*X13) < -0.5),ROUND(S13/T13*X13,2),0),0)","v":0},{"$f":"IF(W13>0,ROUND(W13/T13*S13,2),0)","v":0},null,null,{"$f":"D13","v":0},{"$f":"X13","v":0}]
[null,null,null,null,null,null,null,null,"","",null,null,null,null,null,null,null,null,0,null,null,null,{"$f":"SUM(IF(Aanzuivering!$AC$10:$AC$490=D14,Aanzuivering!$O$10:$O$490,0))","v":0},0,0,0,null,null,0,0]
[null,null,null,null,null,null,null,null,"","",null,null,null,null,null,null,null,null,0,null,null,null,{"$f":"SUM(IF(Aanzuivering!$AC$10:$AC$490=D15,Aanzuivering!$O$10:$O$490,0))","v":0},0,0,0,null,null,0,0]
[null,null,null,null,null,null,null,null,"","",null,null,null,null,null,null,null,null,0,null,null,null,{"$f":"SUM(IF(Aanzuivering!$AC$10:$AC$490=D16,Aanzuivering!$O$10:$O$490,0))","v":0},0,0,0,null,null,0,0]
[null,null,null,null,null,null,null,null,"","",null,null,null,null,null,null,null,null,0,null,null,null,{"$f":"SUM(IF(Aanzuivering!$AC$10:$AC$490=D17,Aanzuivering!$O$10:$O$490,0))","v":0},0,0,0,null,null,0,0]
[null,null,null,null,null,null,null,null,"","",null,null,null,null,null,null,null,null,0,null,null,null,{"$f":"SUM(IF(Aanzuivering!$AC$10:$AC$490=D18,Aanzuivering!$O$10:$O$490,0))","v":0},0,0,0,null,null,0,0]
[null,null,null,null,null,null,null,null,"","",null,null,null,null,null,null,null,null,0,null,null,null,{"$f":"SUM(IF(Aanzuivering!$AC$10:$AC$490=D19,Aanzuivering!$O$10:$O$490,0))","v":0},0,0,0,null,null,0,0]
[null,null,null,null,null,null,null,null,"","",null,null,null,null,null,null,null,null,0,null,null,null,{"$f":"SUM(IF(Aanzuivering!$AC$10:$AC$490=D20,Aanzuivering!$O$10:$O$490,0))","v":0},0,0,0,null,null,0,0]
{"$rows_left_out":473}
{"sheet":"Aanzuivering","index":2,"n_rows":492,"n_cols":35,"rows_kept":492,"cut":false,"hidden":false,"merged":[[491,1,491,3],[7,23,7,25],[25,0,35,0],[7,1,7,4],[0,0,22,0],[0,1,0,2],[0,13,3,13],[1,1,1,2],[6,6,6,10],[7,20,7,22],[1,25,1,26]]}
[{"$f":"'Algemene gegevens'!A1:A23","v":"Aanzuiveringsafrekening BB"},"Douane",null,null,null,null,null,{"$f":"periode","v":0},{"$f":"IF(VALUE(LEFT(H1,4))>1990,DATE(LEFT(H1,4),RIGHT(H1,2)+1,1),\"Geen datum ingevuld\")","v":"Geen datum ingevuld"}]
[null,"Blad 'Aanzuivering' ",null,null,null,"Worksheets(\"BV & Plaatsing\").Range(\"af1:af2\").Name = \"keuzelijst\"",null,null,null,null,null,null,null,null,null,null,null,null,null,null,null,null,null,"EX",null,"Rechten art. 79-1-b"]
[null,"Naam:",{"$f":"naam","v":0},null,null,null,null,null,null,null,null,null,null,null,null,null,null,null,null,null,null,null,null,"EU",null,null,{"$f":"ROUND(SUM($W$11:$W$490)+SUM($Z$11:$Z$490)-SUM($AA$11:$AA$490),2)","v":0}]
[null,"Periode:",{"$f":"periode","v":0}]
[null,null,null,null,null,null,null,null,null,null,"art513"]
[]
[]
[null,"Gegevens aanzuivering",null,null,null,null,null,null,null,null,null,null,null,null,null,null,null,null,null,null,"Ad valorem recht",null,null,"Specifiek recht"]
[null,"Soort aanzuivering","Identificatie aanzuivering","Is sprake van equivalente goederen","Datum        (DD-MM-JJ)","Soort product","Omschrijving product","Datum bereiken bestemming bij overdracht aan NIET-TORO      (DD-MM-JJ)","Hoeveelheid product","Omschrijving geplaatste goederen in het product","Hoeveelheid geplaatste goederen fysiek aanwezig in het product","Totale opbrengst%","Land van bestemming ","Referentienummer","Hoeveelheid geplaatste goederen aan te zuiveren","Aan te zuiveren plaatsingsaangifte (Aangifte Identificatie Nummer) en [omschrijving goederen]","Informatie over plaatsingsaangifte","Foutinformatie","Berekening rechten bij art79","Taric-code","Inv.recht%","Douanewaarde","Rechten AVR","Tarief","Heffingsgrondslag","Rechten SR","Betaalde rechten","Wel of niet OK?","alleen aangiftenummers:",null,null,null,null,null,"Opmerkingen (vrij tekstveld)"]
[null,"lege regel","a","a","a","lege regel","a","a","a","a","a","a","a","a","a","a","a","a","x","x","x","x","x","x","x","x","x",null,null,null,null,null,null,null,"x"]
[null,null,null,null,null,null,null,null,null,null,null,null,null,null,{"$f":"IF(AND(K11>0,L11>0),ROUND(K11/L11*100,2),0)","v":0},null,{"$f":"IF(AC11=\"*****\",\"\",IF(ISERROR(MATCH(AC11,OFFSET(AC11,1,0):$AC$490,0)),INDEX('BV & Plaatsing'!$AC$12:$AD$490,MATCH(AC11,'BV & Plaatsing'!$AC$12:$AC$490,0),2),\"\"))","v":""},{"$f":"IF(AC11=\"*****\",\"\",IF(J11<>MID(P11,SEARCH(\"[\",P11,1)+1,SEARCH(\"]\",P11,1)-SEARCH(\"[\",P11,1)-1),\">> Omschrijving goederen plaatsingsaangifte <> omschrijving geplaatste goederen in product\",\"\"))","v":""},null,null,null,null,null,null,null,null,null,null,{"$f":"IF(RIGHT(P11,1)=\"]\",LEFT(P11,SEARCH(\"[\",P11)-2),\"*****\")","v":"*****"}]
[null,null,null,null,null,null,null,null,null,null,null,null,null,null,{"$f":"IF(AND(K12>0,L12>0),ROUND(K12/L12*100,2),0)","v":0},null,{"$f":"IF(AC12=\"*****\",\"\",IF(ISERROR(MATCH(AC12,OFFSET(AC12,1,0):$AC$490,0)),INDEX('BV & Plaatsing'!$AC$12:$AD$490,MATCH(AC12,'BV & Plaatsing'!$AC$12:$AC$490,0),2),\"\"))","v":""},{"$f":"IF(AC12=\"*****\",\"\",IF(J12<>MID(P12,SEARCH(\"[\",P12,1)+1,SEARCH(\"]\",P12,1)-SEARCH(\"[\",P12,1)-1),\">> Omschrijving goederen plaatsingsaangifte <> omschrijving geplaatste goederen in product\",\"\"))","v":""},null,null,null,null,null,null,null,null,null,null,{"$f":"IF(RIGHT(P12,1)=\"]\",LEFT(P12,SEARCH(\"[\",P12)-2),\"*****\")","v":"*****"}]
[null,null,null,null,null,null,null,null,null,null,null,null,null,null,{"$f":"IF(AND(K13>0,L13>0),ROUND(K13/L13*100,2),0)","v":0},null,{"$f":"IF(AC13=\"*****\",\"\",IF(ISERROR(MATCH(AC13,OFFSET(AC13,1,0):$AC$490,0)),INDEX('BV & Plaatsing'!$AC$12:$AD$490,MATCH(AC13,'BV & Plaatsing'!$AC$12:$AC$490,0),2),\"\"))","v":""},{"$f":"IF(AC13=\"*****\",\"\",IF(J13<>MID(P13,SEARCH(\"[\",P13,1)+1,SEARCH(\"]\",P13,1)-SEARCH(\"[\",P13,1)-1),\">> Omschrijving goederen plaatsingsaangifte <> omschrijving geplaatste goederen in product\",\"\"))","v":""},null,null,null,null,null,null,null,null,null,null,"*****"]
[null,null,null,null,null,null,null,null,null,null,null,null,null,null,0,null,{"$f":"IF(AC14=\"*****\",\"\",IF(ISERROR(MATCH(AC14,OFFSET(AC14,1,0):$AC$490,0)),INDEX('BV & Plaatsing'!$AC$12:$AD$490,MATCH(AC14,'BV & Plaatsing'!$AC$12:$AC$490,0),2),\"\"))","v":""},"",null,null,null,null,null,null,null,null,null,null,"*****"]
[null,null,null,null,null,null,null,null,null,null,null,null,null,null,0,null,{"$f":"IF(AC15=\"*****\",\"\",IF(ISERROR(MATCH(AC15,OFFSET(AC15,1,0):$AC$490,0)),INDEX('BV & Plaatsing'!$AC$12:$AD$490,MATCH(AC15,'BV & Plaatsing'!$AC$12:$AC$490,0),2),\"\"))","v":""},"",null,null,null,null,null,null,null,null,null,null,"*****"]
[null,null,null,null,null,null,null,null,null,null,null,null,null,null,0,null,{"$f":"IF(AC16=\"*****\",\"\",IF(ISERROR(MATCH(AC16,OFFSET(AC16,1,0):$AC$490,0)),INDEX('BV & Plaatsing'!$AC$12:$AD$490,MATCH(AC16,'BV & Plaatsing'!$AC$12:$AC$490,0),2),\"\"))","v":""},"",null,null,null,null,null,null,null,null,null,null,"*****"]
[null,null,null,null,null,null,null,null,null,null,null,null,null,null,0,null,{"$f":"IF(AC17=\"*****\",\"\",IF(ISERROR(MATCH(AC17,OFFSET(AC17,1,0):$AC$490,0)),INDEX('BV & Plaatsing'!$AC$12:$AD$490,MATCH(AC17,'BV & Plaatsing'!$AC$12:$AC$490,0),2),\"\"))","v":""},"",null,null,null,null,null,null,null,null,null,null,"*****"]
[null,null,null,null,null,null,null,null,null,null,null,null,null,null,0,null,{"$f":"IF(AC18=\"*****\",\"\",IF(ISERROR(MATCH(AC18,OFFSET(AC18,1,0):$AC$490,0)),INDEX('BV & Plaatsing'!$AC$12:$AD$490,MATCH(AC18,'BV & Plaatsing'!$AC$12:$AC$490,0),2),\"\"))","v":""},"",null,null,null,null,null,null,null,null,null,null,"*****"]
[null,null,null,null,null,null,null,null,null,null,null,null,null,null,0,null,{"$f":"IF(AC19=\"*****\",\"\",IF(ISERROR(MATCH(AC19,OFFSET(AC19,1,0):$AC$490,0)),INDEX('BV & Plaatsing'!$AC$12:$AD$490,MATCH(AC19,'BV & Plaatsing'!$AC$12:$AC$490,0),2),\"\"))","v":""},"",null,null,null,null,null,null,null,null,null,null,"*****"]
[null,null,null,null,null,null,null,null,null,null,null,null,null,null,0,null,{"$f":"IF(AC20=\"*****\",\"\",IF(ISERROR(MATCH(AC20,OFFSET(AC20,1,0):$AC$490,0)),INDEX('BV & Plaatsing'!$AC$12:$AD$490,MATCH(AC20,'BV & Plaatsing'!$AC$12:$AC$490,0),2),\"\"))","v":""},"",null,null,null,null,null,null,null,null,null,null,"*****"]
{"$rows_left_out":473}
{"sheet":"Tussenblad","index":3,"n_rows":2,"n_cols":27,"rows_kept":2,"cut":false,"hidden":true,"merged":[[1,26,2,26],[1,24,2,24],[1,25,2,25],[1,17,2,17],[1,18,2,18],[1,19,2,19],[1,20,2,20],[1,21,2,21],[1,1,2,1],[1,2,2,2],[1,3,2,3],[1,4,2,4],[1,5,2,5],[1,11,2,11],[1,22,2,22],[1,23,2,23],[1,6,2,6],[1,7,2,7],[1,8,2,8],[1,9,2,9],[1,10,2,10],[1,12,2,12],[1,13,2,13],[1,14,2,14],[1,15,2,15],[1,16,2,16]]}
[]
[null,"Soort mutatie","Soort aangifte","Aangifte Identificatie Nummer","Plaats van afgifte","Datum aanvaarding (DD-MM-JJ)","Datum plaatsing onder de regeling (DD-MM-JJ)","Referentienummer in de administratie","Datum aanzuivering","Is de datum van aanzuivering overschreden?","Omschrijving grondstof (evt.in de vorm van een artikelnummer)","Taric-code","Inv.recht %","Douanewaarde","Invoerrecht","Tarief","Heffingsgrondslag","Rechten SR","Totaal invoerrecht","Hoeveelheid geplaatste goederen","Eenheid hoeveelheid (b.v. kgs)","Hoeveelheid vorige periode(n) aangezuiverd","Hoeveelheid in deze periode aangezuiverd","Restant hoeveelheid","Restant invoerrecht (gerelateerd aan hoeveelheid)","Totaal invoerrecht in deze periode afgeschreven (gerelateerd aan hoeveelheid)","Opmerkingen (vrij tekstveld)"]

{"sheet":"Schriftelijke verklaring","index":4,"n_rows":42,"n_cols":53,"rows_kept":42,"cut":false,"hidden":false,"merged":[[19,1,19,5],[6,3,6,9],[10,1,10,9],[2,11,3,18],[8,11,12,18],[17,11,25,18],[18,1,18,9],[20,1,20,9],[7,3,7,9],[0,1,2,9],[3,1,3,9],[4,1,4,9],[5,3,5,9],[6,1,6,2],[5,1,5,2],[8,3,8,9],[21,1,21,9],[23,8,23,9],[24,8,24,9],[0,0,20,0],[23,0,33,0],[17,1,17,9],[11,1,11,3],[14,1,14,5],[14,6,14,9],[11,4,11,9],[12,1,12,9],[13,1,13,9],[16,1,16,9],[15,1,15,5],[15,6,15,9],[19,6,19,9],[9,1,9,9],[7,1,7,2],[8,1,8,2],[30,11,35,18],[29,1,29,2],[30,1,30,9],[29,3,29,9],[22,1,22,9],[23,1,23,7],[27,1,27,9],[31,3,31,9],[26,1,26,9],[25,8,25,9],[25,1,25,7],[24,1,24,7],[28,1,28,9],[42,1,43,9],[36,1,40,9],[32,1,32,9],[33,2,33,4],[33,6,33,9],[34,1,34,9],[41,1,41,4],[41,5,41,9],[35,1,35,9]]}
[{"$f":"'Algemene gegevens'!A1:A23","v":"Aanzuiveringsafrekening BB"},"De Aanzuiveringsafrekening moet worden begeleid door een schriftelijke verklaring. De daarop vermelde gegevens worden mede gebruikt voor de beoordeling van de betrouwbaarheid van de Aanzuiveringsafrekening.\nAls er geen handelingen zijn en geen voorraad is moet u dit ook schriftelijk verklaren. Hiervoor gebruikt u ook deze verklaring.",null,null,null,null,null,null,null,null,null,null,null,null,null,null,null,null,null,null,null,null,null,null,null,null,null,null,null,null,null,null,null,null,null,null,null,null,null,null,null,null,null,null,null,null,null,null,null,null,null,null,">> maak hier een keuze uit één van de twee opties <<"]
[null,null,null,null,null,null,null,null,null,null,null,null,null,null,null,null,null,null,null,null,null,null,null,null,null,null,null,null,null,null,null,null,null,null,null,null,null,null,null,null,null,null,null,null,null,null,null,null,null,null,null,null,"dat de gegevens in de Aanzuiveringsafrekening juist en volledig zijn."]
[null,null,null,null,null,null,null,null,null,null,null,"Door de knop 'Invullen formulier' te gebruiken wordt het formulier gedeeltelijk ingevuld. De overige velden dienen handmatig te worden ingevuld.  De juistheid van de ingevulde velden blijft uw verantwoordelijkheid. ",null,null,null,null,null,null,null,null,null,null,null,null,null,null,null,null,null,null,null,null,null,null,null,null,null,null,null,null,null,null,null,null,null,null,null,null,null,null,null,null,"dat er geen handelingen zijn en geen voorraad is."]
[]
[null,"Vergunninghouder"]
[null,"Naam: ",null,""]
[null,"Adres:",null,""]
[null,"Plaats:",null,""]
[null,"EORI nummer:",null,"",null,null,null,null,null,null,null,"Met de knop 'Printen formuilier' wordt het formulier opgeslagen in de map van de AAR als pdf (Verklaring van 'bedrijf' over periode 'periode'.pdf). \nHet formulier dient ondertekend te worden door een gemachtigde en dient de AAR te begeleiden. U kunt de handtekening eventueel elektronisch zetten, dit in overleg met het controlekantoor."]
[]
[null,"Periode"]
[null,"Periode en jaar: ",null,null,""]
[]
[null,"Vergunning"]
[null,"Soort vergunning: ",null,null,null,null,""]
[null,"Vergunningnummer: ",null,null,null,null,""]
[]
[null,"Te betalen invoerrecht (art. 79, lid 1, letter b DWU)",null,null,null,null,null,null,null,null,null,"Met de knop hieronder kunt u een nieuwe periode starten:\n- de aangiften met voorraad uit het tabblad 'BV & Plaatsing' worden overgenomen;\n- alle aanzuiveringen uit het tabblad 'Aanzuivering' worden verwijderd; \n- de gegevens in het tabblad 'Schriftelijke verklaring' worden verwijderd. \nLet op: vóórdat u deze knop gebruikt moet u de huidige (oude) periode onder een andere naam hebben opgeslagen. \nNadat de nieuwe periode is gemaakt moet u zelf de periode invullen in het tabblad 'Algemene gegevens'."]
[]
[null,"Het te betalen bedrag aan invoerrecht bedraagt: ",null,null,null,null,""]
{"$rows_left_out":23}
{"sheet":"Vrij blad","index":5,"n_rows":0,"n_cols":0,"rows_kept":0,"cut":false,"hidden":false,"merged":[]}

{"sheet":"Validaties","index":6,"n_rows":68,"n_cols":34,"rows_kept":68,"cut":false,"hidden":true,"merged":[]}
["Mutatiesoorten BV&Inslagen:","Mutatiesoorten Uitslagen:","Mutatiesoorten Bijzonder:","DocSoort:","Administratieve eenheden:","DocSoort Uit:","Mutatie Doorvoeren","Soort uit te voeren","Equivalente goederen","Berekening",null,null,null,null,null,null,null,null,null,null,null,null,null,null,null,null,null,null,null,null,null,null,null,"Rijlabels"]
["BI","AF","BZ","IM","AL (Liters alcohol 100%)","BEREIKT",null,"Geplaatste goederen",null,null,null,null,null,null,null,null,null,null,null,null,null,null,null,null,null,null,null,null,null,null,null,null,null,"3512C HD SRN 0PXF00410"]
["MB","VM","BM","EU","BDLS (Bundels)","NIET-BEREIKT","Ja","Bewerkte goederen","Ja","art. 79-1-b",null,null,null,null,null,null,null,null,null,null,null,null,null,null,null,null,null,null,null,null,null,null,null,"Anchor Pool HHP"]
["CO","VN","CO","GPA","BLEN (Balen)","TORO",null,"Resten en afvallen",null,null,null,null,null,null,null,null,null,null,null,null,null,null,null,null,null,null,null,null,null,null,null,null,null,"Andere scheepsschroeven"]
["BM","VT","OE",null,"BLKN (Blikken)","NIET-TORO",null,null,null,null,null,null,null,null,null,null,null,null,null,null,null,null,null,null,null,null,null,null,null,null,null,null,null,"Andere werken gietijzer staal "]
["BZ","CO",null,null,"BT (Bruto-registerton (2,8316 M3))","UITVOER",null,null,null,null,null,null,null,null,null,null,null,null,null,null,null,null,null,null,null,null,null,null,null,null,null,null,null,"Andere werken gietijzer staal + wire sheaves"]
["OE","BM",null,null,"CC (Milliliters)","VERN",null,null,null,null,null,null,null,null,null,null,null,null,null,null,null,null,null,null,null,null,null,null,null,null,null,null,null,"BOILER PART, LEVEL FLOAT SWITCH"]
[null,"BZ",null,null,"CL (Aantal cellen)","OVERIGE",null,null,null,null,null,null,null,null,null,null,null,null,null,null,null,null,null,null,null,null,null,null,null,null,null,null,null,"Bouten of schroeven van 800 Mpa of meer Bar Bump fastener kit"]
[null,"OE",null,null,"CM2 (Vierkante centimeter)",null,null,null,null,null,null,null,null,null,null,null,null,null,null,null,null,null,null,null,null,null,null,null,null,null,null,null,null,"CAT dieselmotor 3512 1350 bkW S/N 0PXF00416"]
[null,null,null,null,"COLL (Colli)",null,null,null,null,null,null,null,null,null,null,null,null,null,null,null,null,null,null,null,null,null,null,null,null,null,null,null,null,"CAT Marine Engine 3512 1350 bkW S/N 0PXF00423"]
[null,null,null,null,"CONT (Containers)",null,null,null,null,null,null,null,null,null,null,null,null,null,null,null,null,null,null,null,null,null,null,null,null,null,null,null,null,"Caterpilar Marine Engine SRN OPXF00375"]
[null,null,null,null,"CT (Aantal karaat (1 metriekkaraat=2x10-4))",null,null,null,null,null,null,null,null,null,null,null,null,null,null,null,null,null,null,null,null,null,null,null,null,null,null,null,null,"Caterpillar Marine Diesel Engine Model 3512C 1350 bkW s/n 0PXF00343"]
[null,null,null,null,"CTNS (Kartons of dozen)",null,null,null,null,null,null,null,null,null,null,null,null,null,null,null,null,null,null,null,null,null,null,null,null,null,null,null,null,"Caterpillar Marine Diesel Engine model 3516 1825 Kw s/n PXH00252"]
[null,null,null,null,"FLSN (Flessen)",null,null,null,null,null,null,null,null,null,null,null,null,null,null,null,null,null,null,null,null,null,null,null,null,null,null,null,null,"Caterpillar Marine Diesel Engine model C32 994 Kw s/n RSD00494"]
[null,null,null,null,"GR (Gram)",null,null,null,null,null,null,null,null,null,null,null,null,null,null,null,null,null,null,null,null,null,null,null,null,null,null,null,null,"Caterpillar Marine Engine C32 SRN0AX200201"]
[null,null,null,null,"GS (Gram splijtbare isotopen)",null,null,null,null,null,null,null,null,null,null,null,null,null,null,null,null,null,null,null,null,null,null,null,null,null,null,null,null,"Condensate pump ( baggerpomp )"]
[null,null,null,null,"HSPL (Haspels)",null,null,null,null,null,null,null,null,null,null,null,null,null,null,null,null,null,null,null,null,null,null,null,null,null,null,null,null,"Constructiewerken en delen van constructiewerken"]
[null,null,null,null,"K1 (Kilogram ad. 100%)",null,null,"Inslagsoort",null,null,null,null,null,null,null,null,null,null,null,null,null,null,null,null,null,null,null,null,null,null,null,null,null,"Coupling Guard; pipelay products bracket"]
[null,null,null,null,"K2 (Kilogram netto uitlekgewicht)",null,null,"BV",null,null,null,null,null,null,null,null,null,null,null,null,null,null,null,null,null,null,null,null,null,null,null,null,null,"Davit system"]
[null,null,null,null,"KB (Kilogram kaliumhydroxyde (bijtende potas))",null,null,"PLAATSING",null,null,null,null,null,null,null,null,null,null,null,null,null,null,null,null,null,null,null,null,null,null,null,null,null,"Diesel Generator en sets 8H32/40"]
{"$rows_left_out":48}